Target
Hyaluronidase-1
Ligand
BDBM50214744
Substrate
Meas. Tech.
ChEMBL_628271 (CHEMBL1111859)
IC50
>2000000±n/a nM
Citation
 Iwanaga, AKusano, GWarashina, TMiyase, T Phenolic constituents of the aerial parts of Cimicifuga simplex and Cimicifuga japonica. J Nat Prod 73:609-12 (2010)  
Target
Name:
Hyaluronidase-1
Synonyms:
HYAL1 Hyaluronidase Hyaluronoglucosaminidase-1 | LUCA1
Type:
Protein
Mol. Mass.:
48369.09
Organism:
Homo sapiens (Human)
Description:
Q1279
Residue:
435
  
Inhibitor
Name:
BDBM50214744
Synonyms:
(2E)-3-(4-hydroxy-3-methoxyphenyl)prop-2-enoic acid CHEMBL32749 ferulic acid
Type:
Small organic molecule
Emp. Form.:
C10H10O4
Mol. Mass.:
194.184
SMILES:
COc1cc(\C=C\C(O)=O)ccc1O
: