Target
Sialidase
Ligand
BDBM50317435
Substrate
Meas. Tech.
ChEMBL_631812 (CHEMBL1111005)
Ki
1210±n/a nM
Citation
 Nguyen, PHNguyen, TNKang, KWNdinteh, DTMbafor, JTKim, YROh, WK Prenylated pterocarpans as bacterial neuraminidase inhibitors. Bioorg Med Chem 18:3335-44 (2010)  
Target
Name:
Sialidase
Synonyms:
NANH_CLOPF | nanH
Type:
PROTEIN
Mol. Mass.:
42808.79
Organism:
Clostridium perfringens
Description:
ChEMBL_991336
Residue:
382
  
Inhibitor
Name:
BDBM50317435
Synonyms:
CHEMBL1096406 | Erythribyssin O
Type:
Small organic molecule
Emp. Form.:
C21H18O5
Mol. Mass.:
350.3646
SMILES:
[#6]\[#6](-[#6])=[#6]\[#6]-c1c(-[#8])ccc2c3-[#6]-[#8]-c4cc(-[#8])c(-[#6]=O)cc4-c3oc12
: