Target
3-hydroxy-3-methylglutaryl-coenzyme A reductase
Ligand
BDBM50321100
Substrate
Meas. Tech.
ChEMBL_637422 (CHEMBL1166355)
IC50
4820±n/a nM
Citation
 Pak, VVKoo, MKwon, DYShakhidoyatov, KMYun, L Peptide fragmentation as an approach in modeling of an active peptide and designing a competitive inhibitory peptide for HMG-CoA reductase. Bioorg Med Chem 18:4300-9 (2010)  
Target
Name:
3-hydroxy-3-methylglutaryl-coenzyme A reductase
Synonyms:
3-hydroxy-3-methylglutaryl-coenzyme A (HMG-CoA) reductase HMDH_HUMAN HMG-CoA reductase (HMGR) | HMGCR
Type:
Enzyme
Mol. Mass.:
97477.10
Organism:
Homo sapiens (Human)
Description:
P04035
Residue:
888
  
Inhibitor
Name:
BDBM50321100
Synonyms:
CHEMBL1164546 | GF(4-fluro)PTGG
Type:
Small organic molecule
Emp. Form.:
C24H33FN6O8
Mol. Mass.:
552.5526
SMILES:
C[C@@H](O)[C@H](NC(=O)[C@@H]1CCCN1C(=O)[C@H](Cc1ccc(F)cc1)NC(=O)CN)C(=O)NCC(=O)NCC(O)=O
: