Target
Falcipain 2
Ligand
BDBM50321812
Substrate
Meas. Tech.
ChEMBL_641372 (CHEMBL1175064)
Ki
8900±n/a nM
Citation
 Ettari, RZappalà, MMicale, NSchirmeister, TGelhaus, CLeippe, MEvers, AGrasso, S Synthesis of novel peptidomimetics as inhibitors of protozoan cysteine proteases falcipain-2 and rhodesain. Eur J Med Chem 45:3228-33 (2010)  
Target
Name:
Falcipain 2
Synonyms:
Cysteine protease falcipain-2 Falcipain-2
Type:
Enzyme
Mol. Mass.:
55912.60
Organism:
Plasmodium falciparum
Description:
Recombinant falcipain-2.
Residue:
484
  
Inhibitor
Name:
BDBM50321812
Synonyms:
(4-Chloro-2-trifluoromethyl-phenyl)-carbamic acid 1-{[(2S,3S)-2-benzyloxy-5-oxo-tetrahydrofuran-3-ylcarbamoyl]-methyl}-(3R)-2-oxo-5-phenyl-2,3-dihydro-1H-benzo[e][1,4]diazepin-3-ylmethyl ester | CHEMBL1171868
Type:
Small organic molecule
Emp. Form.:
C37H30ClF3N4O7
Mol. Mass.:
735.105
SMILES:
FC(F)(F)c1cc(Cl)ccc1NC(=O)OC[C@H]1N=C(c2ccccc2)c2ccccc2N(CC(=O)N[C@H]2CC(=O)O[C@@H]2OCc2ccccc2)C1=O
: