Target
Beta-2 adrenergic receptor
Ligand
BDBM50324835
Substrate
Meas. Tech.
ChEMBL_651475 (CHEMBL1227592)
Ki
0.300000±n/a nM
Citation
 Beattie, DBradley, MBrearley, ACharlton, SJCuenoud, BMFairhurst, RAGedeck, PGosling, MJanus, DJones, DLewis, CMcCarthy, COakman, HStringer, RTaylor, RJTuffnell, A A physical properties based approach for the exploration of a 4-hydroxybenzothiazolone series of beta2-adrenoceptor agonists as inhaled long-acting bronchodilators. Bioorg Med Chem Lett 20:5302-7 (2010)  
Target
Name:
Beta-2 adrenergic receptor
Synonyms:
ADRB2 ADRB2_HUMAN Beta-2 adrenoceptor | Beta-2 adrenoreceptor
Type:
Mol. Mass.:
46461.69
Organism:
Homo sapiens (Human)
Description:
P07550
Residue:
413
  
Inhibitor
Name:
BDBM50324835
Synonyms:
(R)-4-hydroxy-7-(1-hydroxy-2-(3-(methyl(phenyl)amino)propylamino)ethyl)benzo[d]thiazol-2(3H)-one | CHEMBL1221804
Type:
Small organic molecule
Emp. Form.:
C19H23N3O3S
Mol. Mass.:
373.469
SMILES:
CN(CCCNC[C@H](O)c1ccc(O)c2[nH]c(=O)sc12)c1ccccc1
: