Target
Melanin-concentrating hormone receptor 1
Ligand
BDBM50325956
Substrate
Meas. Tech.
ChEMBL_654168 (CHEMBL1228974)
IC50
180±n/a nM
Citation
 Sasmal, PKSasmal, SRao, PTVenkatesham, BRoshaiah, MAbbineni, CKhanna, IJadhav, VPSuresh, JTalwar, RMuzeeb, SReceveur, JMFrimurer, TMRist, ØElster, LHögberg, T Discovery of novel, orally available benzimidazoles as melanin concentrating hormone receptor 1 (MCHR1) antagonists. Bioorg Med Chem Lett 20:5443-8 (2010)  
Target
Name:
Melanin-concentrating hormone receptor 1
Synonyms:
G-protein coupled receptor 24 MCH receptor 1 MCH-R1 MCHR-1 MCHR1_HUMAN Melanin-Concentrating Hormone Receptor 1 (MCH1R) Melanin-concentrating hormone receptor 1 (MCH-1) Melanin-concentrating hormone receptor 1 (MCHR-1) SLC-1 Somatostatin receptor-like protein
Type:
G Protein-Coupled Receptor (GPCR)
Mol. Mass.:
45976.27
Organism:
Homo sapiens (Human)
Description:
Membranes from CHO-K1 cells stably expressing human MCH1R were used in assays.
Residue:
422
  
Inhibitor
Name:
BDBM50325956
Synonyms:
CHEMBL1223886 | N-(3-(1-(3-(1-(3-methoxybenzyl)-1H-benzo[d]imidazol-2-ylamino)propyl)piperidin-4-yl)phenyl)acetamide
Type:
Small organic molecule
Emp. Form.:
C31H37N5O2
Mol. Mass.:
511.6578
SMILES:
COc1cccc(Cn2c(NCCCN3CCC(CC3)c3cccc(NC(C)=O)c3)nc3ccccc23)c1
: