Target
Baculoviral IAP repeat-containing protein 3
Ligand
BDBM50326214
Substrate
Meas. Tech.
ChEMBL_659436 (CHEMBL1248346)
Ki
4.2±n/a nM
Citation
 Sun, HLu, JLiu, LYi, HQiu, SYang, CYDeschamps, JRWang, S Nonpeptidic and potent small-molecule inhibitors of cIAP-1/2 and XIAP proteins. J Med Chem 53:6361-7 (2010)  
Target
Name:
Baculoviral IAP repeat-containing protein 3
Synonyms:
API2 BIRC3_HUMAN Baculoviral IAP repeat-containing protein 3 (IAP1 BIR3) MIHC XIAP-BIR3 | cIAP1/cIAP2
Type:
Protein
Mol. Mass.:
68365.75
Organism:
Homo sapiens (Human)
Description:
Q13489
Residue:
604
  
Inhibitor
Name:
BDBM50326214
Synonyms:
(3S,6S,9R,10aR)-N-Benzhydryl-6-((S)-2-(methylamino)-propanamido)-5-oxo-9-(2-phenylacetamido)decahydropyrrolo-[1,2-a]azocine-3-carboxamide | CHEMBL1241424
Type:
Small organic molecule
Emp. Form.:
C36H43N5O4
Mol. Mass.:
609.7577
SMILES:
CN[C@@H](C)C(=O)N[C@H]1CC[C@H](C[C@H]2CC[C@H](N2C1=O)C(=O)NC(c1ccccc1)c1ccccc1)NC(=O)Cc1ccccc1
: