Target
Beta-2 adrenergic receptor
Ligand
BDBM25771
Substrate
Meas. Tech.
ChEMBL_658303 (CHEMBL1246860)
EC50
0.07±n/a nM
Citation
 Glossop, PALane, CAPrice, DABunnage, MELewthwaite, RAJames, KBrown, ADYeadon, MPerros-Huguet, CTrevethick, MAClarke, NPWebster, RJones, RMBurrows, JLFeeder, NTaylor, SCSpence, FJ Inhalation by design: novel ultra-long-actingß(2)-adrenoreceptor agonists for inhaled once-daily treatment of asthma and chronic obstructive pulmonary disease that utilize a sulfonamide agonist headgroup. J Med Chem 53:6640-52 (2010)  
Target
Name:
Beta-2 adrenergic receptor
Synonyms:
ADRB2 ADRB2_HUMAN Beta-2 adrenoceptor | Beta-2 adrenoreceptor
Type:
Mol. Mass.:
46461.69
Organism:
Homo sapiens (Human)
Description:
P07550
Residue:
413
  
Inhibitor
Name:
BDBM25771
Synonyms:
1-hydroxy-2-naphthoic acid;4-[1-hydroxy-2-[6-(4-phenylbutoxy)hexylamino]ethyl]-2-methylol-phenol Aeromax Serevent | salmeterol xinafoate
Type:
Small organic molecule
Emp. Form.:
C25H37NO4
Mol. Mass.:
415.5656
SMILES:
OCc1cc(ccc1O)C(O)CNCCCCCCOCCCCc1ccccc1
: