Target
Cytochrome c oxidase subunit 2
Ligand
BDBM50326831
Substrate
Meas. Tech.
ChEMBL_662815 (CHEMBL1252215)
IC50
77±n/a nM
Citation
 Zarghi, AGhodsi, R Design, synthesis, and biological evaluation of ketoprofen analogs as potent cyclooxygenase-2 inhibitors. Bioorg Med Chem 18:5855-60 (2010)  
Target
Name:
Cytochrome c oxidase subunit 2
Synonyms:
COII COX2_SHEEP Cytochrome c oxidase polypeptide II MTCO2
Type:
PROTEIN
Mol. Mass.:
25987.16
Organism:
Ovis aries
Description:
ChEMBL_662815
Residue:
227
  
Inhibitor
Name:
BDBM50326831
Synonyms:
2-(4-azido)phenyl)-6-benzoyl-quinoline-4-carboxylic acid | CHEMBL1254873
Type:
Small organic molecule
Emp. Form.:
C23H14N4O3
Mol. Mass.:
394.3823
SMILES:
OC(=O)c1cc(nc2ccc(cc12)C(=O)c1ccccc1)-c1ccc(cc1)N=[N+]=[N-]
: