Target
Class D beta-lactamase
Ligand
BDBM50021959
Substrate
Meas. Tech.
ChEMBL_667505 (CHEMBL1262145)
IC50
2000±n/a nM
Citation
 Meziane-Cherif, DLambert, TDupêchez, MCourvalin, PGalimand, M Genetic and biochemical characterization of OXA-63, a new class D beta-lactamase from Brachyspira pilosicoli BM4442. Antimicrob Agents Chemother 52:1264-8 (2008)  
Target
Name:
Class D beta-lactamase
Synonyms:
Type:
PROTEIN
Mol. Mass.:
30708.53
Organism:
Brachyspira pilosicoli
Description:
ChEMBL_667505
Residue:
268
  
Inhibitor
Name:
BDBM50021959
Synonyms:
CHEMBL777 US9120808, Clavulanic acid potassium salt clavulanic acid
Type:
Small organic molecule
Emp. Form.:
C8H9NO5
Mol. Mass.:
199.1608
SMILES:
OC\C=C1/O[C@@H]2CC(=O)N2[C@H]1C(O)=O
: