Target
Class D beta-lactamase
Ligand
BDBM50053173
Substrate
Meas. Tech.
ChEMBL_667505 (CHEMBL1262145)
IC50
160±n/a nM
Citation
 Meziane-Cherif, DLambert, TDupêchez, MCourvalin, PGalimand, M Genetic and biochemical characterization of OXA-63, a new class D beta-lactamase from Brachyspira pilosicoli BM4442. Antimicrob Agents Chemother 52:1264-8 (2008)  
Target
Name:
Class D beta-lactamase
Synonyms:
Type:
PROTEIN
Mol. Mass.:
30708.53
Organism:
Brachyspira pilosicoli
Description:
ChEMBL_667505
Residue:
268
  
Inhibitor
Name:
BDBM50053173
Synonyms:
(2S,3S,5R)-3-Methyl-4,4,7-trioxo-3-[1,2,3]triazol-1-ylmethyl-4-thia-1-aza-bicyclo[3.2.0]heptane-2-carboxylic acid (2S,3S,5R)-3-methyl-4,4,7-trioxo-3-[1,2,3]triazol-1-ylmethyl-4lambda6-thia-1-aza-bicyclo[3.2.0]heptane-2-carboxylic acid 3-Methyl-4,4,7-trioxo-3-[1,2,3]triazol-1-ylmethyl-4lambda*6*-thia-1-aza-bicyclo[3.2.0]heptane-2-carboxylic acid CL-298741 US9120808, Tazobactam sodium salt YTR-830H | Zosyn
Type:
Small organic molecule
Emp. Form.:
C10H12N4O5S
Mol. Mass.:
300.291
SMILES:
C[C@]1(Cn2ccnn2)[C@@H](N2[C@@H](CC2=O)S1(=O)=O)C(O)=O
: