Target
Dihydrofolate reductase
Ligand
BDBM50329609
Substrate
Meas. Tech.
ChEMBL_674962 (CHEMBL1272639)
IC50
1100±n/a nM
Citation
 Beierlein, JMKarri, NGAnderson, AC Targeted mutations of Bacillus anthracis dihydrofolate reductase condense complex structure-activity relationships. J Med Chem 53:7327-36 (2010)  
Target
Name:
Dihydrofolate reductase
Synonyms:
Dihydrofolate Reductase (DHFR) | baDHFR
Type:
Enzyme
Mol. Mass.:
19120.62
Organism:
Bacillus anthracis
Description:
baDHFR was expressed in E. coli BL21, and purified to homogeneity.
Residue:
162
  
Inhibitor
Name:
BDBM50329609
Synonyms:
5-(3-(biphenyl-3-yl)prop-1-ynyl)-6-ethylpyrimidine-2,4-diamine | CHEMBL1270439
Type:
Small organic molecule
Emp. Form.:
C21H20N4
Mol. Mass.:
328.4103
SMILES:
CCc1nc(N)nc(N)c1C#CCc1cccc(c1)-c1ccccc1
: