Target
Fructose-bisphosphate aldolase
Ligand
BDBM50330437
Substrate
Meas. Tech.
ChEMBL_684840 (CHEMBL1286070)
Ki
17000±n/a nM
Citation
 Daher, RCoinçon, MFonvielle, MGest, PMGuerin, MEJackson, MSygusch, JTherisod, M Rational design, synthesis, and evaluation of new selective inhibitors of microbial class II (zinc dependent) fructose bis-phosphate aldolases. J Med Chem 53:7836-42 (2010)  
Target
Name:
Fructose-bisphosphate aldolase
Synonyms:
ALF_HELPY FBPA fba
Type:
PROTEIN
Mol. Mass.:
33770.88
Organism:
Helicobacter pylori
Description:
ChEMBL_684840
Residue:
307
  
Inhibitor
Name:
BDBM50330437
Synonyms:
1,6-di-O-phosphono-D-fructose CHEMBL1235112
Type:
Small organic molecule
Emp. Form.:
C6H14O12P2
Mol. Mass.:
340.1157
SMILES:
OC(COP(O)(O)=O)[C@@H](O)C(=O)[C@H](O)COP(O)(O)=O
: