Target
Fructose-bisphosphate aldolase
Ligand
BDBM50330434
Substrate
Meas. Tech.
ChEMBL_684841 (CHEMBL1286071)
Ki
276±n/a nM
Citation
 Daher, RCoinçon, MFonvielle, MGest, PMGuerin, MEJackson, MSygusch, JTherisod, M Rational design, synthesis, and evaluation of new selective inhibitors of microbial class II (zinc dependent) fructose bis-phosphate aldolases. J Med Chem 53:7836-42 (2010)  
Target
Name:
Fructose-bisphosphate aldolase
Synonyms:
37 kDa major allergen FBA1 FBPA IgE-binding allergen
Type:
PROTEIN
Mol. Mass.:
39211.38
Organism:
Candida albicans
Description:
ChEMBL_684841
Residue:
359
  
Inhibitor
Name:
BDBM50330434
Synonyms:
4-(N-hydroxy-2-(phosphonooxy)acetamido)butyl hexanoate | CHEMBL1278086
Type:
Small organic molecule
Emp. Form.:
C12H24NO8P
Mol. Mass.:
341.2946
SMILES:
CCCCCC(=O)OCCCCN(O)C(=O)COP(O)(O)=O
: