Target
Fructose-bisphosphate aldolase
Ligand
BDBM50330438
Substrate
Meas. Tech.
ChEMBL_684841 (CHEMBL1286071)
Ki
200±n/a nM
Citation
 Daher, RCoinçon, MFonvielle, MGest, PMGuerin, MEJackson, MSygusch, JTherisod, M Rational design, synthesis, and evaluation of new selective inhibitors of microbial class II (zinc dependent) fructose bis-phosphate aldolases. J Med Chem 53:7836-42 (2010)  
Target
Name:
Fructose-bisphosphate aldolase
Synonyms:
37 kDa major allergen FBA1 FBPA IgE-binding allergen
Type:
PROTEIN
Mol. Mass.:
39211.38
Organism:
Candida albicans
Description:
ChEMBL_684841
Residue:
359
  
Inhibitor
Name:
BDBM50330438
Synonyms:
3-{hydroxy[(phosphonooxy)acetyl]amino}propyl dihydrogen phosphate | CHEMBL1235276
Type:
Small organic molecule
Emp. Form.:
C5H13NO10P2
Mol. Mass.:
309.1049
SMILES:
ON(CCCOP(O)(O)=O)C(=O)COP(O)(O)=O
: