Target
Chymotrypsinogen A
Ligand
BDBM50330784
Substrate
Meas. Tech.
ChEMBL_685422 (CHEMBL1285321)
IC50
>500000±n/a nM
Citation
 Eidam, ORomagnoli, CCaselli, EBabaoglu, KPohlhaus, DTKarpiak, JBonnet, RShoichet, BKPrati, F Design, synthesis, crystal structures, and antimicrobial activity of sulfonamide boronic acids asß-lactamase inhibitors. J Med Chem 53:7852-63 (2010)  
Target
Name:
Chymotrypsinogen A
Synonyms:
Alpha-chymotrypsin Chymotrypsin A Chymotrypsin A chain B Chymotrypsinogen A | alpha-Chymotrypsin (α-Chymotrypsin)
Type:
Serine protease
Mol. Mass.:
25670.88
Organism:
Bos taurus (bovine)
Description:
Residue:
245
  
Inhibitor
Name:
BDBM50330784
Synonyms:
CHEMBL1231476 {[(benzylsulfonyl)amino]methyl}boronic acid
Type:
Small organic molecule
Emp. Form.:
C8H12BNO4S
Mol. Mass.:
229.061
SMILES:
OB(O)CNS(=O)(=O)Cc1ccccc1
: