Target
Acetyl-CoA carboxylase 1
Ligand
BDBM50332552
Substrate
Meas. Tech.
ChEMBL_695124 (CHEMBL1640872)
IC50
2900±n/a nM
Citation
 Keil, SMüller, MZoller, GHaschke, GSchroeter, KGlien, MRuf, SFocken, IHerling, AWSchmoll, D Identification and synthesis of novel inhibitors of acetyl-CoA carboxylase with in vitro and in vivo efficacy on fat oxidation. J Med Chem 53:8679-87 (2010)  
Target
Name:
Acetyl-CoA carboxylase 1
Synonyms:
ACACA_RAT Acac Acetyl-CoA carboxylase Acetyl-CoA carboxylase 1 (ACC1)
Type:
Protein
Mol. Mass.:
265183.92
Organism:
Rattus norvegicus (Rat)
Description:
P11497
Residue:
2345
  
Inhibitor
Name:
BDBM50332552
Synonyms:
CHEMBL1630708 US8470841, 2
Type:
Small organic molecule
Emp. Form.:
C22H28N2O3
Mol. Mass.:
368.4693
SMILES:
CC(CCc1ccc(Oc2ccc(OC3CCCC3)cn2)cc1)NC(C)=O
: