Target
Acetyl-CoA carboxylase 1
Ligand
BDBM50332556
Substrate
Meas. Tech.
ChEMBL_695122 (CHEMBL1640870)
IC50
>30000±n/a nM
Citation
 Keil, SMüller, MZoller, GHaschke, GSchroeter, KGlien, MRuf, SFocken, IHerling, AWSchmoll, D Identification and synthesis of novel inhibitors of acetyl-CoA carboxylase with in vitro and in vivo efficacy on fat oxidation. J Med Chem 53:8679-87 (2010)  
Target
Name:
Acetyl-CoA carboxylase 1
Synonyms:
ACAC ACACA_HUMAN ACC1 Acetyl-CoA carboxylase 1 | Acetyl-CoA carboxylase 1 (ACC1)
Type:
Protein
Mol. Mass.:
265543.22
Organism:
Homo sapiens (Human)
Description:
Q13085
Residue:
2346
  
Inhibitor
Name:
BDBM50332556
Synonyms:
CHEMBL1630704 trans-N-(3-(5-(4-(benzyloxy)phenoxy)-1,3-dioxan-2-yl)propyl)acetamide
Type:
Small organic molecule
Emp. Form.:
C22H27NO5
Mol. Mass.:
385.4535
SMILES:
CC(=O)NCCC[C@H]1OC[C@@H](CO1)Oc1ccc(OCc2ccccc2)cc1
: