Target
Acetyl-CoA carboxylase 2
Ligand
BDBM50332552
Substrate
Meas. Tech.
ChEMBL_695121 (CHEMBL1640869)
IC50
140±n/a nM
Citation
 Keil, SMüller, MZoller, GHaschke, GSchroeter, KGlien, MRuf, SFocken, IHerling, AWSchmoll, D Identification and synthesis of novel inhibitors of acetyl-CoA carboxylase with in vitro and in vivo efficacy on fat oxidation. J Med Chem 53:8679-87 (2010)  
Target
Name:
Acetyl-CoA carboxylase 2
Synonyms:
ACACB ACC-beta ACCB Acetyl-CoA carboxylase 2 Acetyl-CoA carboxylase 2 (ACC2)
Type:
Protein
Mol. Mass.:
276535.21
Organism:
Homo sapiens (Human)
Description:
O00763
Residue:
2458
  
Inhibitor
Name:
BDBM50332552
Synonyms:
CHEMBL1630708 US8470841, 2
Type:
Small organic molecule
Emp. Form.:
C22H28N2O3
Mol. Mass.:
368.4693
SMILES:
CC(CCc1ccc(Oc2ccc(OC3CCCC3)cn2)cc1)NC(C)=O
: