Target
Acetyl-CoA carboxylase 2
Ligand
BDBM50332556
Substrate
Meas. Tech.
ChEMBL_695121 (CHEMBL1640869)
IC50
400±n/a nM
Citation
 Keil, SMüller, MZoller, GHaschke, GSchroeter, KGlien, MRuf, SFocken, IHerling, AWSchmoll, D Identification and synthesis of novel inhibitors of acetyl-CoA carboxylase with in vitro and in vivo efficacy on fat oxidation. J Med Chem 53:8679-87 (2010)  
Target
Name:
Acetyl-CoA carboxylase 2
Synonyms:
ACACB ACC-beta ACCB Acetyl-CoA carboxylase 2 Acetyl-CoA carboxylase 2 (ACC2)
Type:
Protein
Mol. Mass.:
276535.21
Organism:
Homo sapiens (Human)
Description:
O00763
Residue:
2458
  
Inhibitor
Name:
BDBM50332556
Synonyms:
CHEMBL1630704 trans-N-(3-(5-(4-(benzyloxy)phenoxy)-1,3-dioxan-2-yl)propyl)acetamide
Type:
Small organic molecule
Emp. Form.:
C22H27NO5
Mol. Mass.:
385.4535
SMILES:
CC(=O)NCCC[C@H]1OC[C@@H](CO1)Oc1ccc(OCc2ccccc2)cc1
: