Target
Interstitial collagenase
Ligand
BDBM13080
Substrate
Meas. Tech.
ChEMBL_694544 (CHEMBL1635953)
Ki
174±n/a nM
Citation
 Attolino, ECalderone, VDragoni, EFragai, MRichichi, BLuchinat, CNativi, C Structure-based approach to nanomolar, water soluble matrix metalloproteinases inhibitors (MMPIs). Eur J Med Chem 45:5919-25 (2010)  
Target
Name:
Interstitial collagenase
Synonyms:
CLG MMP1 Matrix metalloproteinase-1 | Matrix metalloproteinase-1 (MMP-1)
Type:
Enzyme
Mol. Mass.:
54010.26
Organism:
Homo sapiens (Human)
Description:
P03956
Residue:
469
  
Inhibitor
Name:
BDBM13080
Synonyms:
CGS 27023A Analog 3 US20230357139, Compound A | US20240050571, Compound NNGH
Type:
Small organic molecule
Emp. Form.:
C13H20N2O5S
Mol. Mass.:
316.373
SMILES:
COc1ccc(cc1)S(=O)(=O)N(CC(C)C)CC(=O)NO
: