Target
Beta-lactamase
Ligand
BDBM50021954
Substrate
Meas. Tech.
ChEMBL_696792 (CHEMBL1639005)
Ki
167000±n/a nM
Citation
 Papp-Wallace, KMTaracila, MHornick, JMHujer, AMHujer, KMDistler, AMEndimiani, ABonomo, RA Substrate selectivity and a novel role in inhibitor discrimination by residue 237 in the KPC-2 beta-lactamase. Antimicrob Agents Chemother 54:2867-77 (2010)  
Target
Name:
Beta-lactamase
Synonyms:
Class A carbapenemase KPC-2
Type:
PROTEIN
Mol. Mass.:
31116.99
Organism:
Escherichia coli
Description:
ChEMBL_696792
Residue:
293
  
Inhibitor
Name:
BDBM50021954
Synonyms:
(2S,5R)-3,3-Dimethyl-4,4,7-trioxo-4lambda*6*-thia-1-aza-bicyclo[3.2.0]heptane-2-carboxylic acid 3,3-Dimethyl-4,4,7-trioxo-4lambda*6*-thia-1-aza-bicyclo[3.2.0]heptane-2-carboxylic acid CHEMBL403 SULBACTAM US20230322715, Compound ALK-09 | US9120808, Sulbactam sodium salt
Type:
Small organic molecule
Emp. Form.:
C8H11NO5S
Mol. Mass.:
233.242
SMILES:
CC1(C)[C@@H](N2[C@@H](CC2=O)S1(=O)=O)C(O)=O
: