Target
Nuclear receptor subfamily 1 group I member 2
Ligand
BDBM50333703
Substrate
Meas. Tech.
ChEMBL_700443 (CHEMBL1647982)
EC50
>30000±n/a nM
Citation
 Tyagarajan, SChakravarty, PKPark, MZhou, BHerrington, JBRatliff, KBugianesi, RMWilliams, BHaedo, RJSwensen, AMWarren, VASmith, MGarcia, MKaczorowski, GJMcManus, OBLyons, KALi, XMadeira, MKaranam, BGreen, MForrest, MJAbbadie, CMcGowan, EMistry, SJochnowitz, NDuffy, JL A potent and selective indole N-type calcium channel (Ca(v)2.2) blocker for the treatment of pain. Bioorg Med Chem Lett 21:869-73 (2011)  
Target
Name:
Nuclear receptor subfamily 1 group I member 2
Synonyms:
NR1I2 Orphan nuclear receptor PAR1 PXR SXR nuclear receptor subfamily 1 group I member 2 isoform 1
Type:
Nuclear receptor
Mol. Mass.:
49774.77
Organism:
Homo sapiens (Human)
Description:
O75469
Residue:
434
  
Inhibitor
Name:
BDBM50333703
Synonyms:
CHEMBL1643724 | N-tert-butyl-2-(1-(2-(tert-butylamino)-2-oxoethyl)-2-(3,5-dimethylphenyl)-1H-indol-5-yl)-2-methylpropanamide
Type:
Small organic molecule
Emp. Form.:
C30H41N3O2
Mol. Mass.:
475.6654
SMILES:
Cc1cc(C)cc(c1)-c1cc2cc(ccc2n1CC(=O)NC(C)(C)C)C(C)(C)C(=O)NC(C)(C)C
: