Target
Voltage-dependent N-type calcium channel subunit alpha-1B
Ligand
BDBM50333712
Substrate
Meas. Tech.
ChEMBL_700439 (CHEMBL1647978)
IC50
600±n/a nM
Citation
 Tyagarajan, SChakravarty, PKPark, MZhou, BHerrington, JBRatliff, KBugianesi, RMWilliams, BHaedo, RJSwensen, AMWarren, VASmith, MGarcia, MKaczorowski, GJMcManus, OBLyons, KALi, XMadeira, MKaranam, BGreen, MForrest, MJAbbadie, CMcGowan, EMistry, SJochnowitz, NDuffy, JL A potent and selective indole N-type calcium channel (Ca(v)2.2) blocker for the treatment of pain. Bioorg Med Chem Lett 21:869-73 (2011)  
Target
Name:
Voltage-dependent N-type calcium channel subunit alpha-1B
Synonyms:
BIII CAC1B_HUMAN CACNA1B Calcium channel (Type N) Voltage-dependent N-type calcium channel subunit alpha-1B Voltage-gated N-type calcium channel alpha-1B subunit Voltage-gated calcium channel Voltage-gated calcium channel subunit alpha Cav2.2 ((alpha 1B, beta 1b, alpha 2 delta-1) | calcium channel, voltage-dependent, N type, alpha 1B subunit
Type:
Enzyme
Mol. Mass.:
262548.16
Organism:
Homo sapiens (Human)
Description:
Q00975
Residue:
2339
  
Inhibitor
Name:
BDBM50333712
Synonyms:
(S)-tert-butyl 2-(3,5-dimethylphenyl)-5-(1-ethoxy-2-methyl-1-oxopropan-2-yl)-3-(1-hydroxypropan-2-yl)-1H-indole-1-carboxylate | CHEMBL1643713
Type:
Small organic molecule
Emp. Form.:
C30H39NO5
Mol. Mass.:
493.6344
SMILES:
CCOC(=O)C(C)(C)c1ccc2n(C(=O)OC(C)(C)C)c(c([C@H](C)CO)c2c1)-c1cc(C)cc(C)c1
: