Target
Nuclear receptor subfamily 1 group I member 2
Ligand
BDBM50333723
Substrate
Meas. Tech.
ChEMBL_700443 (CHEMBL1647982)
EC50
6640±n/a nM
Citation
 Tyagarajan, SChakravarty, PKPark, MZhou, BHerrington, JBRatliff, KBugianesi, RMWilliams, BHaedo, RJSwensen, AMWarren, VASmith, MGarcia, MKaczorowski, GJMcManus, OBLyons, KALi, XMadeira, MKaranam, BGreen, MForrest, MJAbbadie, CMcGowan, EMistry, SJochnowitz, NDuffy, JL A potent and selective indole N-type calcium channel (Ca(v)2.2) blocker for the treatment of pain. Bioorg Med Chem Lett 21:869-73 (2011)  
Target
Name:
Nuclear receptor subfamily 1 group I member 2
Synonyms:
NR1I2 Orphan nuclear receptor PAR1 PXR SXR nuclear receptor subfamily 1 group I member 2 isoform 1
Type:
Nuclear receptor
Mol. Mass.:
49774.77
Organism:
Homo sapiens (Human)
Description:
O75469
Residue:
434
  
Inhibitor
Name:
BDBM50333723
Synonyms:
CHEMBL1643738 | N-tert-butyl-5-(1-(tert-butylamino)-2-methyl-1-oxopropan-2-yl)-1-(2-(tert-butylamino)-2-oxoethyl)-1H-indole-2-carboxamide
Type:
Small organic molecule
Emp. Form.:
C27H42N4O3
Mol. Mass.:
470.6474
SMILES:
CC(C)(C)NC(=O)Cn1c(cc2cc(ccc12)C(C)(C)C(=O)NC(C)(C)C)C(=O)NC(C)(C)C
: