Target
Amine oxidase [flavin-containing] A
Ligand
BDBM50334292
Substrate
Meas. Tech.
ChEMBL_699650 (CHEMBL1648130)
IC50
2190±n/a nM
Citation
 Manley-King, CIBergh, JJPetzer, JP Inhibition of monoamine oxidase by selected C5- and C6-substituted isatin analogues. Bioorg Med Chem 19:261-74 (2011)  
Target
Name:
Amine oxidase [flavin-containing] A
Synonyms:
AOFA_HUMAN MAO-A Monoamine oxidase Monoamine oxidase type A (MAO A) Monoamine oxidase type A (MAOA)
Type:
Protein
Mol. Mass.:
59689.53
Organism:
Homo sapiens (Human)
Description:
P21397
Residue:
527
  
Inhibitor
Name:
BDBM50334292
Synonyms:
5-(4-Phenylbutyl)isatin | CHEMBL1642678
Type:
Small organic molecule
Emp. Form.:
C18H17NO2
Mol. Mass.:
279.3331
SMILES:
O=C1Nc2ccc(CCCCc3ccccc3)cc2C1=O
: