Target
Growth factor receptor-bound protein 7
Ligand
BDBM50334298
Substrate
Meas. Tech.
ChEMBL_699661 (CHEMBL1648304)
Kd
3060±n/a nM
Citation
 Ambaye, NDGunzburg, MJLim, RCPrice, JTWilce, MCWilce, JA Benzopyrazine derivatives: A novel class of growth factor receptor bound protein 7 antagonists. Bioorg Med Chem 19:693-701 (2011)  
Target
Name:
Growth factor receptor-bound protein 7
Synonyms:
B47 GRB7 GRB7_HUMAN
Type:
PROTEIN
Mol. Mass.:
59700.56
Organism:
Homo sapiens (Human)
Description:
ChEMBL_699661
Residue:
532
  
Inhibitor
Name:
BDBM50334298
Synonyms:
CHEMBL1642691 | methyl 3-(6-benzoyl-3-hydroxyquinoxalin-2-yl)-2,4,5-trioxo-5-(para-tolylamino)pentanoate
Type:
Small organic molecule
Emp. Form.:
C28H21N3O7
Mol. Mass.:
511.4822
SMILES:
COC(=O)C(=O)C(C(=O)C(=O)Nc1ccc(C)cc1)c1nc2ccc(cc2[nH]c1=O)C(=O)c1ccccc1
: