Target
Neuronal acetylcholine receptor subunit alpha-6
Ligand
BDBM50119782
Substrate
Meas. Tech.
ChEMBL_701134 (CHEMBL1648232)
IC50
180±n/a nM
Citation
 Zhang, ZZheng, GPivavarchyk, MDeaciuc, AGDwoskin, LPCrooks, PA Novel bis-, tris-, and tetrakis-tertiary amino analogs as antagonists at neuronal nicotinic receptors that mediate nicotine-evoked dopamine release. Bioorg Med Chem Lett 21:88-91 (2010)  
Target
Name:
Neuronal acetylcholine receptor subunit alpha-6
Synonyms:
ACHA6_RAT Chrna6 Neuronal acetylcholine receptor subunit alpha-6 | Neuronal acetylcholine receptor subunit alpha-6/beta-3
Type:
PROTEIN
Mol. Mass.:
56943.53
Organism:
Rattus norvegicus
Description:
ChEMBL_1454451
Residue:
493
  
Inhibitor
Name:
BDBM50119782
Synonyms:
1,1''-(decane-1,10-diyl)bis(3-methylpyridinium)iodide 3-methyl-1-[6-(3-methylpyridinium-1-yl)decyl]pyridinium; Diiodide CHEMBL55181
Type:
Small organic molecule
Emp. Form.:
C22H34N2
Mol. Mass.:
326.5177
SMILES:
Cc1ccc[n+](CCCCCCCCCC[n+]2cccc(C)c2)c1
: