Target
Galectin-4
Ligand
BDBM50336202
Substrate
Meas. Tech.
ChEMBL_716454 (CHEMBL1670078)
Kd
58±n/a nM
Citation
 Murakami, TYoshioka, KSato, YTanaka, MNiwa, OYabuki, S Synthesis and galectin-binding activities of mercaptododecyl glycosides containing a terminalß-galactosyl group. Bioorg Med Chem Lett 21:1265-9 (2011)  
Target
Name:
Galectin-4
Synonyms:
Antigen NY-CO-27 L-36 lactose-binding protein LEG4_HUMAN Lactose-binding lectin 4
Type:
PROTEIN
Mol. Mass.:
35952.28
Organism:
Homo sapiens (Human)
Description:
ChEMBL_716454
Residue:
323
  
Inhibitor
Name:
BDBM50336202
Synonyms:
12-Mercaptododecyl-beta-D-galactopyranosyl-(1->4)-2-deoxy-alpha-D-arabino-hexopyranoside | CHEMBL1669630
Type:
Small organic molecule
Emp. Form.:
C24H46O10S
Mol. Mass.:
526.681
SMILES:
OC[C@H]1O[C@@H](O[C@H]2[C@H](O)C[C@@H](OCCCCCCCCCCCCS)O[C@@H]2CO)[C@H](O)[C@@H](O)[C@H]1O
: