Target
Lactoylglutathione lyase
Ligand
BDBM50067040
Substrate
Meas. Tech.
ChEMBL_716548 (CHEMBL1670272)
Ki
10000±n/a nM
Citation
 Yuan, MLuo, MSong, YXu, QWang, XCao, YBu, XRen, YHu, X Identification of curcumin derivatives as human glyoxalase I inhibitors: A combination of biological evaluation, molecular docking, 3D-QSAR and molecular dynamics simulation studies. Bioorg Med Chem 19:1189-96 (2011)  
Target
Name:
Lactoylglutathione lyase
Synonyms:
Aldoketomutase Glx I Glyoxalase I LGUL_HUMAN S-D-lactoylglutathione methylglyoxal lyase
Type:
Enzyme
Mol. Mass.:
20772.95
Organism:
Homo sapiens (Human)
Description:
Q04760
Residue:
184
  
Inhibitor
Name:
BDBM50067040
Synonyms:
((E,E)-1,7-bis(4-hydroxy-3-methoxyphenyl)-1,6-heptadiene-3,5-dione) (1E,4Z,6E)-5-hydroxy-1,7-bis(4-hydroxy-3-methoxyphenyl)hepta-1,4,6-trien-3-one (1E,6E)-1,7-bis(4-hydroxy-3-methoxyphenyl)-1,6-heptadiene-3,5-dione (1Z,6E)-1,7-Bis-(4-hydroxy-3-methoxy-phenyl)-hepta-1,6-diene-3,5-dione 1,7-Bis-(4-hydroxy-3-methoxy-phenyl)-hepta-1,6-diene-3,5-dione 1,7-bis(4-hydroxy-3-methoxyphenyl)-1,6-heptadiene-3,5-dione 1,7-bis(4-hydroxy-3-methoxyphenyl)hepta-1,6-diene-3,5-dione 5-Hydroxy-1,7-bis-(4-hydroxy-3-methoxy-phenyl)-hepta-1,4,6-trien-3-one CHEMBL116438 curcumin I curcurmin | diferuloylmethane
Type:
Small organic molecule
Emp. Form.:
C21H20O6
Mol. Mass.:
368.3799
SMILES:
COc1cc(C=CC(=O)CC(=O)C=Cc2ccc(O)c(OC)c2)ccc1O
: