Target
Cysteine proteinase falcipain 2a
Ligand
BDBM50286441
Substrate
Meas. Tech.
ChEMBL_730499 (CHEMBL1697469)
IC50
98±n/a nM
Citation
 Lisk, GPain, MGluzman, IYKambhampati, SFuruya, TSu, XZFay, MPGoldberg, DEDesai, SA Changes in the plasmodial surface anion channel reduce leupeptin uptake and can confer drug resistance in Plasmodium falciparum-infected erythrocytes. Antimicrob Agents Chemother 52:2346-54 (2008)  
Target
Name:
Cysteine proteinase falcipain 2a
Synonyms:
Cysteine protease falcipain-2
Type:
Protein
Mol. Mass.:
55996.21
Organism:
Plasmodium falciparum
Description:
Q9NBD4
Residue:
484
  
Inhibitor
Name:
BDBM50286441
Synonyms:
(S)-2-((S)-2-Acetylamino-4-(S)-methyl-pentanoylamino)-4-methyl-pentanoic acid (1-formyl-4-guanidino-butyl)-amide (S)-2-Acetylamino-4-methyl-pentanoic acid [(S)-1-((S)-1-formyl-4-guanidino-butylcarbamoyl)-3-methyl-butyl]-amide (S)-2-acetylamino-4-methyl-pentanoic acid [(S)-2-(1-formyl-4-guanidino-butylamino)-4-methyl-pentanoyl]-amide Ac-LLR-CHO CHEMBL129157
Type:
Small organic molecule
Emp. Form.:
C20H38N6O5
Mol. Mass.:
442.5529
SMILES:
CC(C)C[C@H](NC(C)=O)C(=O)N[C@@H](CC(C)C)C(=O)N[C@@H](CCCNC(N)=N)C(O)=O
: