Target
M1 family aminopeptidase
Ligand
BDBM50339787
Substrate
Meas. Tech.
ChEMBL_735637 (CHEMBL1693339)
Ki
>15000±n/a nM
Citation
 Velmourougane, GHarbut, MBDalal, SMcGowan, SOellig, CAMeinhardt, NWhisstock, JCKlemba, MGreenbaum, DC Synthesis of new (-)-bestatin-based inhibitor libraries reveals a novel binding mode in the S1 pocket of the essential malaria M1 metalloaminopeptidase. J Med Chem 54:1655-66 (2011)  
Target
Name:
M1 family aminopeptidase
Synonyms:
AMPN_PLAF7 Zinc aminopeptidase | m1-family aminopeptidase
Type:
PROTEIN
Mol. Mass.:
126072.31
Organism:
Plasmodium falciparum (isolate FcB1 / Columbia)
Description:
ChEMBL_735637
Residue:
1085
  
Inhibitor
Name:
BDBM50339787
Synonyms:
(S)-2-((2S,3R)-3-amino-2-hydroxy-4-phenylbutanamido)-3-(naphthalen-2-yl)propanoic acid | CHEMBL1689151
Type:
Small organic molecule
Emp. Form.:
C23H24N2O4
Mol. Mass.:
392.4477
SMILES:
N[C@H](Cc1ccccc1)[C@H](O)C(=O)N[C@@H](Cc1ccc2ccccc2c1)C(O)=O
: