Target
Delta-type opioid receptor
Ligand
BDBM50341317
Substrate
Meas. Tech.
ChEMBL_742674 (CHEMBL1769552)
IC50
0.316228±n/a nM
Citation
 Yamamoto, TNair, PLargent-Milnes, TMJacobsen, NEDavis, PMa, SWYamamura, HIVanderah, TWPorreca, FLai, JHruby, VJ Discovery of a potent and efficacious peptide derivative ford/µ opioid agonist/neurokinin 1 antagonist activity with a 2',6'-dimethyl-L-tyrosine: in vitro, in vivo, and NMR-based structural studies. J Med Chem 54:2029-38 (2011)  
Target
Name:
Delta-type opioid receptor
Synonyms:
D-OR-1 Delta opioid receptor OPIATE Delta OPRD1 OPRK1 | opioid receptor, delta 1
Type:
G Protein-Coupled Receptor (GPCR)
Mol. Mass.:
40382.98
Organism:
Homo sapiens (Human)
Description:
Competition binding assays were carried out using membrane preparations from transfected HN9.10 cells that constitutively expressed the delta opioid receptor.
Residue:
372
  
Inhibitor
Name:
BDBM50341317
Synonyms:
(S)-1-((2S,5S,11R,14S)-14-amino-5-benzyl-2-butyl-15-(4-hydroxy-2,6-dimethylphenyl)-11-methyl-4,7,10,13-tetraoxo-3,6,9,12-tetraazapentadecane)-N-((S)-1-((S)-1-(3,4-dimethoxybenzylamino)-3-(1H-indol-3-yl)-1-oxopropan-2-ylamino)-4-methyl-1-oxopentan-2-yl)pyrrolidine-2-carboxamide | CHEMBL1766207
Type:
Small organic molecule
Emp. Form.:
C62H82N10O11
Mol. Mass.:
1143.3749
SMILES:
CCCC[C@H](NC(=O)[C@H](Cc1ccccc1)NC(=O)CNC(=O)[C@@H](C)NC(=O)[C@@H](N)Cc1c(C)cc(O)cc1C)C(=O)N1CCC[C@H]1C(=O)N[C@@H](CC(C)C)C(=O)N[C@@H](Cc1c[nH]c2ccccc12)C(=O)NCc1ccc(OC)c(OC)c1
: