Target
Tyrosine-protein phosphatase non-receptor type 1
Ligand
BDBM50342237
Substrate
Meas. Tech.
ChEMBL_743530 (CHEMBL1767971)
IC50
2230±n/a nM
Citation
 Bahta, MLountos, GTDyas, BKim, SEUlrich, RGWaugh, DSBurke, TR Utilization of nitrophenylphosphates and oxime-based ligation for the development of nanomolar affinity inhibitors of the Yersinia pestis outer protein H (YopH) phosphatase. J Med Chem 54:2933-43 (2011)  
Target
Name:
Tyrosine-protein phosphatase non-receptor type 1
Synonyms:
PTN1_HUMAN PTPN1 Protein tyrosine phosphatase-1B (PTP1B) Protein-tyrosine phosphatase 1B (PTP1B) Tyrosine-protein phosphatase non-receptor type 1 (PTP1B)
Type:
Protein phosphatase
Mol. Mass.:
49963.76
Organism:
Homo sapiens (Human)
Description:
Human recombinant GST-fusion PTP1B (1-435).
Residue:
435
  
Inhibitor
Name:
BDBM50342237
Synonyms:
(E)-5-((((3'-(Difluoro(phosphono)methyl)-[1,1'-biphenyl]-4-yl)methoxy)imino)methyl)furan-2-carboxylic acid | CHEMBL1766712
Type:
Small organic molecule
Emp. Form.:
C20H16F2NO7P
Mol. Mass.:
451.3141
SMILES:
OC(=O)c1ccc(\C=N\OCc2ccc(cc2)-c2cccc(c2)C(F)(F)P(O)(O)=O)o1
: