Target
Dual specificity protein phosphatase 14
Ligand
BDBM50342237
Substrate
Meas. Tech.
ChEMBL_743532 (CHEMBL1767973)
IC50
>400000±n/a nM
Citation
 Bahta, MLountos, GTDyas, BKim, SEUlrich, RGWaugh, DSBurke, TR Utilization of nitrophenylphosphates and oxime-based ligation for the development of nanomolar affinity inhibitors of the Yersinia pestis outer protein H (YopH) phosphatase. J Med Chem 54:2933-43 (2011)  
Target
Name:
Dual specificity protein phosphatase 14
Synonyms:
DUS14_HUMAN MAP kinase phosphatase 6 MKP-6 MKP6 | Mitogen-activated protein kinase phosphatase 6
Type:
PROTEIN
Mol. Mass.:
22267.79
Organism:
Homo sapiens (Human)
Description:
ChEMBL_743532
Residue:
198
  
Inhibitor
Name:
BDBM50342237
Synonyms:
(E)-5-((((3'-(Difluoro(phosphono)methyl)-[1,1'-biphenyl]-4-yl)methoxy)imino)methyl)furan-2-carboxylic acid | CHEMBL1766712
Type:
Small organic molecule
Emp. Form.:
C20H16F2NO7P
Mol. Mass.:
451.3141
SMILES:
OC(=O)c1ccc(\C=N\OCc2ccc(cc2)-c2cccc(c2)C(F)(F)P(O)(O)=O)o1
: