Target
Cholinesterase
Ligand
BDBM50089619
Substrate
Meas. Tech.
ChEMBL_744972 (CHEMBL1771987)
IC50
18000±n/a nM
Citation
 Al-Rashid, ZFHsung, RP (+)-Arisugacin A--computational evidence of a dual binding site covalent inhibitor of acetylcholinesterase. Bioorg Med Chem Lett 21:2687-91 (2011)  
Target
Name:
Cholinesterase
Synonyms:
Acylcholine acylhydrolase Butyrylcholine esterase (BChE) Butyrylcholinesterase (BuChE) CHLE_HUMAN Cholinesterases Pseudocholinesterase
Type:
Homotetramer
Mol. Mass.:
68422.27
Organism:
Homo sapiens (Human)
Description:
P06276
Residue:
602
  
Inhibitor
Name:
BDBM50089619
Synonyms:
9-(3,4-Dimethoxy-phenyl)-4a,12a-dihydroxy-4,4,6a,12b-tetramethyl-4a,6,6a,12,12a,12b-hexahydro-4H,5H-7,10-dioxa-benzo[a]anthracene-1,11-dione | CHEMBL283509
Type:
Small organic molecule
Emp. Form.:
C28H32O8
Mol. Mass.:
496.5489
SMILES:
COc1ccc(cc1OC)-c1cc2O[C@]3(C)CC[C@@]4(O)C(C)(C)C=CC(=O)[C@]4(C)[C@@]3(O)Cc2c(=O)o1
: