Target
Baculoviral IAP repeat-containing protein 2
Ligand
BDBM26218
Substrate
Meas. Tech.
ChEMBL_746787 (CHEMBL1777017)
IC50
60±n/a nM
Citation
 Sun, HLiu, LLu, JBai, LLi, XNikolovska-Coleska, ZMcEachern, DYang, CYQiu, SYi, HSun, DWang, S Potent bivalent Smac mimetics: effect of the linker on binding to inhibitor of apoptosis proteins (IAPs) and anticancer activity. J Med Chem 54:3306-18 (2011)  
Target
Name:
Baculoviral IAP repeat-containing protein 2
Synonyms:
API1 BIRC2_HUMAN Cellular inhibitor of apoptosis 1 MIHB | RNF48
Type:
Protein
Mol. Mass.:
69900.47
Organism:
Homo sapiens (Human)
Description:
Q13490
Residue:
618
  
Inhibitor
Name:
BDBM26218
Synonyms:
(3S,6S,10aS)-N-(diphenylmethyl)-6-[(2S)-2-(methylamino)propanamido]-5-oxo-decahydropyrrolo[1,2-a]azocine-3-carboxamide bicyclic Smac peptide mimetic, 20
Type:
Small organic molecule
Emp. Form.:
C28H36N4O3
Mol. Mass.:
476.6104
SMILES:
CN[C@@H](C)C(=O)N[C@H]1CCCC[C@H]2CC[C@H](N2C1=O)C(=O)NC(c1ccccc1)c1ccccc1
: