Target
Mannose-6-phosphate isomerase
Ligand
BDBM44454
Substrate
Meas. Tech.
ChEMBL_747525 (CHEMBL1777059)
IC50
4800±n/a nM
Citation
 Dahl, RBravo, YSharma, VIchikawa, MDhanya, RPHedrick, MBrown, BRascon, JVicchiarelli, MMangravita-Novo, AYang, LStonich, DSu, YSmith, LHSergienko, EFreeze, HHCosford, ND Potent, selective, and orally available benzoisothiazolone phosphomannose isomerase inhibitors as probes for congenital disorder of glycosylation Ia. J Med Chem 54:3661-8 (2011)  
Target
Name:
Mannose-6-phosphate isomerase
Synonyms:
MPI MPI_HUMAN PMI1
Type:
PROTEIN
Mol. Mass.:
46651.35
Organism:
Homo sapiens (Human)
Description:
ChEMBL_1448919
Residue:
423
  
Inhibitor
Name:
BDBM44454
Synonyms:
2-(2-furanylmethylidene)-5-(3-methoxyphenyl)-7-methyl-3-oxo-5H-thiazolo[3,2-a]pyrimidine-6-carboxylic acid ethyl ester MLS000108373 cid_2879747 ethyl 2-(furan-2-ylmethylidene)-5-(3-methoxyphenyl)-7-methyl-3-oxo-5H-[1,3]thiazolo[3,2-a]pyrimidine-6-carboxylate
Type:
Small organic molecule
Emp. Form.:
C22H20N2O5S
Mol. Mass.:
424.47
SMILES:
CCOC(=O)C1=C(C)N=c2sc(=Cc3ccco3)c(=O)n2C1c1cccc(OC)c1
: