Target
Vasopressin V1b receptor
Ligand
BDBM50345129
Substrate
Meas. Tech.
ChEMBL_748738 (CHEMBL1780591)
Ki
0.81±n/a nM
Citation
 Oost, TBackfisch, GBhowmik, Svan Gaalen, MMGeneste, HHornberger, WLubisch, WNetz, AUnger, LWernet, W Potent and selective oxindole-based vasopressin 1b receptor antagonists with improved pharmacokinetic properties. Bioorg Med Chem Lett 21:3828-31 (2011)  
Target
Name:
Vasopressin V1b receptor
Synonyms:
AVPR V1b AVPR1B Antidiuretic hormone receptor 1b V1bR VPR3 Vasopressin V1b receptor (V1b) Vasopressin V3 receptor
Type:
Enzyme
Mol. Mass.:
46985.01
Organism:
Homo sapiens (Human)
Description:
P47901
Residue:
424
  
Inhibitor
Name:
BDBM50345129
Synonyms:
(S)-1-((R)-5-chloro-1-(2,4-dimethoxyphenylsulfonyl)-3-(2-methoxy-4-(pyrrolidin-1-ylmethyl)phenyl)-2-oxoindolin-3-yl)-N,N-dimethylpyrrolidine-2-carboxamide | CHEMBL1779405
Type:
Small organic molecule
Emp. Form.:
C35H41ClN4O7S
Mol. Mass.:
697.241
SMILES:
COc1ccc(c(OC)c1)S(=O)(=O)N1C(=O)[C@@](N2CCC[C@H]2C(=O)N(C)C)(c2cc(Cl)ccc12)c1ccc(CN2CCCC2)cc1OC
: