Target
Glycogen synthase kinase 3
Ligand
BDBM7287
Substrate
Meas. Tech.
ChEMBL_749959 (CHEMBL1786936)
IC50
>10000±n/a nM
Citation
 Power, DPLozach, OMeijer, LGrayson, DHConnon, SJ Concise synthesis and CDK/GSK inhibitory activity of the missing 9-azapaullones. Bioorg Med Chem Lett 20:4940-4 (2010)  
Target
Name:
Glycogen synthase kinase 3
Synonyms:
Type:
PROTEIN
Mol. Mass.:
51607.56
Organism:
Plasmodium falciparum (isolate 3D7)
Description:
ChEMBL_749959
Residue:
440
  
Inhibitor
Name:
BDBM7287
Synonyms:
8,18-diazatetracyclo[9.7.0.0^{2,7}.0^{12,17}]octadeca-1(11),2,4,6,12(17),13,15-heptaen-9-one NSC 641166 | Paullone
Type:
Small organic molecule
Emp. Form.:
C16H12N2O
Mol. Mass.:
248.2793
SMILES:
O=C1Cc2c([nH]c3ccccc23)-c2ccccc2N1
: