Target
Glycogen synthase kinase 3
Ligand
BDBM50346235
Substrate
Meas. Tech.
ChEMBL_749959 (CHEMBL1786936)
IC50
>10000±n/a nM
Citation
 Power, DPLozach, OMeijer, LGrayson, DHConnon, SJ Concise synthesis and CDK/GSK inhibitory activity of the missing 9-azapaullones. Bioorg Med Chem Lett 20:4940-4 (2010)  
Target
Name:
Glycogen synthase kinase 3
Synonyms:
Type:
PROTEIN
Mol. Mass.:
51607.56
Organism:
Plasmodium falciparum (isolate 3D7)
Description:
ChEMBL_749959
Residue:
440
  
Inhibitor
Name:
BDBM50346235
Synonyms:
9-azapaullone | CHEMBL1782168
Type:
Small organic molecule
Emp. Form.:
C15H11N3O
Mol. Mass.:
249.2673
SMILES:
O=C1Cc2c([nH]c3ccncc23)-c2ccccc2N1
: