Target
Glycogen synthase kinase 3
Ligand
BDBM50346237
Substrate
Meas. Tech.
ChEMBL_749959 (CHEMBL1786936)
IC50
>10000±n/a nM
Citation
 Power, DPLozach, OMeijer, LGrayson, DHConnon, SJ Concise synthesis and CDK/GSK inhibitory activity of the missing 9-azapaullones. Bioorg Med Chem Lett 20:4940-4 (2010)  
Target
Name:
Glycogen synthase kinase 3
Synonyms:
Type:
PROTEIN
Mol. Mass.:
51607.56
Organism:
Plasmodium falciparum (isolate 3D7)
Description:
ChEMBL_749959
Residue:
440
  
Inhibitor
Name:
BDBM50346237
Synonyms:
9-Oxy-5,12-dihydro-7H-5,9,12-triaza-dibenzo[a,e]azulen-6-one | CHEMBL1782170
Type:
Small organic molecule
Emp. Form.:
C15H11N3O2
Mol. Mass.:
265.2667
SMILES:
[O-][n+]1ccc2[nH]c-3c(CC(=O)Nc4ccccc-34)c2c1
: