Target
Fatty acid-binding protein, adipocyte
Ligand
BDBM50346465
Substrate
Meas. Tech.
ChEMBL_751845 (CHEMBL1785600)
Ki
6±n/a nM
Citation
 Liu, XHuang, XLin, WWang, DDiao, YLi, HHui, XWang, YXu, AWu, DKe, D New aromatic substituted pyrazoles as selective inhibitors of human adipocyte fatty acid-binding protein. Bioorg Med Chem Lett 21:2949-52 (2011)  
Target
Name:
Fatty acid-binding protein, adipocyte
Synonyms:
A-FABP ALBP FABP4 Fatty acid binding protein adipocyte Fatty acid-binding protein 4 (FABP4)
Type:
Enzyme
Mol. Mass.:
14719.23
Organism:
Homo sapiens (Human)
Description:
P15090
Residue:
132
  
Inhibitor
Name:
BDBM50346465
Synonyms:
2-(2'-(1-(4-chlorophenyl)-5-(thiophen-2-yl)-1H-pyrazol-3-yl)biphenyl-3-yloxy)butanoic acid | CHEMBL1782968
Type:
Small organic molecule
Emp. Form.:
C29H23ClN2O3S
Mol. Mass.:
515.023
SMILES:
CCC(Oc1cccc(c1)-c1ccccc1-c1cc(-c2cccs2)n(n1)-c1ccc(Cl)cc1)C(O)=O
: