Target
Lysine-specific demethylase 4E
Ligand
BDBM50418773
Substrate
Meas. Tech.
ChEMBL_754088 (CHEMBL1798566)
Ki
1980±n/a nM
Citation
 Lohse, BKristensen, JLKristensen, LHAgger, KHelin, KGajhede, MClausen, RP Inhibitors of histone demethylases. Bioorg Med Chem 19:3625-36 (2011)  
Target
Name:
Lysine-specific demethylase 4E
Synonyms:
2-OG-Dependent Histone Demethylase JMJD2E Jumonji domain-containing protein 2E (JMJD2E) KDM4DL KDM4E_HUMAN Lysine-specific demethylase 4E | Lysine-specific demethylase 4E (KDM4E)
Type:
Enzyme
Mol. Mass.:
56815.71
Organism:
Homo sapiens (Human)
Description:
B2RXH2
Residue:
506
  
Inhibitor
Name:
BDBM50418773
Synonyms:
CARBIDOPA
Type:
Small organic molecule
Emp. Form.:
C10H14N2O4
Mol. Mass.:
226.2292
SMILES:
C[C@@](Cc1ccc(O)c(O)c1)(NN)C(O)=O
: