Target
Interferon-induced, double-stranded RNA-activated protein kinase
Ligand
BDBM7238
Substrate
Meas. Tech.
ChEMBL_756675 (CHEMBL1805140)
IC50
5000±n/a nM
Citation
 Bryk, RWu, KRaimundo, BCBoardman, PEChao, PConn, GLAnderson, ECole, JLDuffy, NPNathan, CGriffin, JH Identification of new inhibitors of protein kinase R guided by statistical modeling. Bioorg Med Chem Lett 21:4108-14 (2011)  
Target
Name:
Interferon-induced, double-stranded RNA-activated protein kinase
Synonyms:
E2AK2_HUMAN Eukaryotic translation initiation factor 2-alpha kinase 2 P1/eIF-2A protein kinase PRKR Protein kinase RNA-activated eIF-2A protein kinase 2 | p68 kinase
Type:
PROTEIN
Mol. Mass.:
62104.61
Organism:
Homo sapiens (Human)
Description:
ChEMBL_1467743
Residue:
551
  
Inhibitor
Name:
BDBM7238
Synonyms:
(3Z)-3-(1H-imidazol-5-ylmethylidene)-5-methoxy-2,3-dihydro-1H-indol-2-one SU9516 imidazole indolinone driv.
Type:
Small organic molecule
Emp. Form.:
C13H11N3O2
Mol. Mass.:
241.2453
SMILES:
COc1ccc2NC(=O)C(=Cc3cnc[nH]3)c2c1
: