Target
Matrix metalloproteinase-14
Ligand
BDBM11870
Substrate
Meas. Tech.
ChEMBL_754465 (CHEMBL1806090)
IC50
5.6±n/a nM
Citation
 Becker, DPBarta, TEBedell, LJBoehm, TLBond, BRCarroll, JCarron, CPDecrescenzo, GAEaston, AMFreskos, JNFunckes-Shippy, CLHeron, MHockerman, SHoward, CPKiefer, JRLi, MHMathis, KJMcDonald, JJMehta, PPMunie, GESunyer, TSwearingen, CAVillamil, CIWelsch, DWilliams, JMYu, YYao, J Orally active MMP-1 sparinga-tetrahydropyranyl anda-piperidinyl sulfone matrix metalloproteinase (MMP) inhibitors with efficacy in cancer, arthritis, and cardiovascular disease. J Med Chem 53:6653-80 (2010)  
Target
Name:
Matrix metalloproteinase-14
Synonyms:
MMP-14 MMP14 MT-MMP 1 MT1MMP Matrix Metalloproteinase-14 (MMP-14) Matrix metalloproteinase-14 Membrane-type matrix metalloproteinase 1 | Membrane-type-1 matrix metalloproteinase
Type:
Protein
Mol. Mass.:
65900.19
Organism:
Homo sapiens (Human)
Description:
P50281
Residue:
582
  
Inhibitor
Name:
BDBM11870
Synonyms:
4-{[4-(4-Chlorophenoxy)phenyl]sulfonyl}-N-hydroxy tetrahydro-2H-pyran-4-carboxamide alpha-sulfone 21
Type:
Small organic molecule
Emp. Form.:
C18H18ClNO6S
Mol. Mass.:
411.857
SMILES:
ONC(=O)C1(CCOCC1)S(=O)(=O)c1ccc(Oc2ccc(Cl)cc2)cc1
: