Target
Matrix metalloproteinase-14
Ligand
BDBM50348684
Substrate
Meas. Tech.
ChEMBL_754465 (CHEMBL1806090)
IC50
1.3±n/a nM
Citation
 Becker, DPBarta, TEBedell, LJBoehm, TLBond, BRCarroll, JCarron, CPDecrescenzo, GAEaston, AMFreskos, JNFunckes-Shippy, CLHeron, MHockerman, SHoward, CPKiefer, JRLi, MHMathis, KJMcDonald, JJMehta, PPMunie, GESunyer, TSwearingen, CAVillamil, CIWelsch, DWilliams, JMYu, YYao, J Orally active MMP-1 sparinga-tetrahydropyranyl anda-piperidinyl sulfone matrix metalloproteinase (MMP) inhibitors with efficacy in cancer, arthritis, and cardiovascular disease. J Med Chem 53:6653-80 (2010)  
Target
Name:
Matrix metalloproteinase-14
Synonyms:
MMP-14 MMP14 MT-MMP 1 MT1MMP Matrix Metalloproteinase-14 (MMP-14) Matrix metalloproteinase-14 Membrane-type matrix metalloproteinase 1 | Membrane-type-1 matrix metalloproteinase
Type:
Protein
Mol. Mass.:
65900.19
Organism:
Homo sapiens (Human)
Description:
P50281
Residue:
582
  
Inhibitor
Name:
BDBM50348684
Synonyms:
CHEMBL1801397
Type:
Small organic molecule
Emp. Form.:
C22H21F3N2O6S
Mol. Mass.:
498.472
SMILES:
ONC(=O)C1(CCN(CC#C)CC1)S(=O)(=O)c1ccc(Oc2ccc(OC(F)(F)F)cc2)cc1
: