Target
Cytochrome P450 2C19
Ligand
BDBM50348710
Substrate
Meas. Tech.
ChEMBL_755033 (CHEMBL1805935)
EC50
>60000±n/a nM
Citation
 Payne, JEBonnefous, CSymons, KTNguyen, PMSablad, MRozenkrants, NZhang, YWang, LYazdani, NShiau, AKNoble, SARix, PRao, TSHassig, CASmith, ND Discovery of dual inducible/neuronal nitric oxide synthase (iNOS/nNOS) inhibitor development candidate 4-((2-cyclobutyl-1H-imidazo[4,5-b]pyrazin-1-yl)methyl)-7,8-difluoroquinolin-2(1H)-one (KD7332) part 2: identification of a novel, potent, and selective series of benzimidazole-quinolinone iNOS/nNO J Med Chem 53:7739-55 (2010)  
Target
Name:
Cytochrome P450 2C19
Synonyms:
(R)-limonene 6-monooxygenase (S)-limonene 7-monooxygenase CYP2C19 CYPIIC19 Cytochrome P450 2C19 [I331V] Cytochrome P450-254C Mephenytoin 4-hydroxylase P450-254C
Type:
Enzyme
Mol. Mass.:
55935.47
Organism:
Homo sapiens (Human)
Description:
P33261
Residue:
490
  
Inhibitor
Name:
BDBM50348710
Synonyms:
CHEMBL1801506
Type:
Small organic molecule
Emp. Form.:
C19H17F2N5O
Mol. Mass.:
369.368
SMILES:
CC(C)Cc1nc2nccnc2n1Cc1cc(=O)[nH]c2c(F)c(F)ccc12
: