Target
Bis(5'-adenosyl)-triphosphatase
Ligand
BDBM50350513
Substrate
Meas. Tech.
ChEMBL_762663 (CHEMBL1817387)
Ki
35±n/a nM
Citation
 Krakowiak, APecherzewska, RKaczmarek, RTomaszewska, ANawrot, BStec, WJ Evaluation of influence of Ap4A analogues on Fhit-positive HEK293T cells; cytotoxicity and ability to induce apoptosis. Bioorg Med Chem 19:5053-60 (2011)  
Target
Name:
Bis(5'-adenosyl)-triphosphatase
Synonyms:
AP3A hydrolase Bis(5'adenosyl)-triphosphatase FHIT Fragile histidine triad protein
Type:
Protein
Mol. Mass.:
16861.00
Organism:
Homo sapiens (Human)
Description:
P49789
Residue:
147
  
Inhibitor
Name:
BDBM50350513
Synonyms:
CHEMBL1812069
Type:
Small organic molecule
Emp. Form.:
C33H44N15O18P3S3
Mol. Mass.:
1127.908
SMILES:
Nc1ncnc2n(cnc12)[C@@H]1O[C@H](COP(S)(=O)OCC(COP(S)(=O)OC[C@H]2O[C@H]([C@H](O)[C@@H]2O)n2cnc3c(N)ncnc23)OP(S)(=O)OC[C@H]2O[C@H]([C@H](O)[C@@H]2O)n2cnc3c(N)ncnc23)[C@@H](O)[C@H]1O
: