Target
Vasopressin V1a receptor
Ligand
BDBM50350874
Substrate
Meas. Tech.
ChEMBL_763490 (CHEMBL1819839)
EC50
0.14±n/a nM
Citation
 Wisniewski, KGalyean, RTariga, HAlagarsamy, SCroston, GHeitzmann, JKohan, AWisniewska, HLaporte, RRivière, PJSchteingart, CD New, potent, selective, and short-acting peptidic V1a receptor agonists. J Med Chem 54:4388-98 (2011)  
Target
Name:
Vasopressin V1a receptor
Synonyms:
AVPR V1a AVPR1A V1AR_HUMAN VASOPRESSIN V1A Vasopressin V1 receptor Vasopressin receptor
Type:
Receptor
Mol. Mass.:
46820.18
Organism:
Homo sapiens (Human)
Description:
P37288
Residue:
418
  
Inhibitor
Name:
BDBM50350874
Synonyms:
CHEMBL1819540
Type:
Small organic molecule
Emp. Form.:
C45H63N13O11S2
Mol. Mass.:
1026.192
SMILES:
NCCC[C@H](NC(=O)[C@@H]1CCCN1C(=O)[C@@H]1CSSC[C@H](N)C(=O)N[C@@H](Cc2ccccc2)C(=O)N[C@@H](Cc2ccccc2)C(=O)N[C@@H](CCC(N)=O)C(=O)N[C@@H](CC(N)=O)C(=O)N1)C(=O)NCC(N)=O
: